{"text_format":"1","workbook":"xlsx","n_sheets":9,"sheets":["Project Information","Validation Sheet","Input Form","Trunking Translation","Quotation","Instructions","Configurator","Components","Art. List"],"not_rendered":{"charts":0,"images":14,"macros":1,"external_links":0,"defined_names":261,"comments":2,"pivot_tables":0},"unopened":[],"bounds":{"document_bytes":16777216,"sheet_cells":100000,"rows_first":2000,"rows_last":500,"rows_between":2000,"halvings":0,"cell_chars":16384,"cell_head_chars":4096},"cells_cut":0,"cells_raw":0,"read":"whole","date_system":"1900"}

{"sheet":"Project Information","index":0,"n_rows":130,"n_cols":14,"rows_kept":130,"cut":false,"hidden":false,"merged":[[42,3,42,6],[43,3,43,6],[44,3,44,6],[45,3,45,6],[46,3,46,6],[47,3,47,6],[48,3,48,6],[2,4,2,5],[20,1,20,13],[21,1,25,13],[29,1,29,13],[30,7,30,13],[10,3,10,4],[27,1,27,6],[27,7,27,13],[31,7,31,13],[3,1,4,13],[6,1,6,13],[8,5,8,11],[10,5,10,11],[16,5,16,11],[18,3,18,4],[18,5,18,11],[12,3,12,4],[12,5,12,11],[14,1,14,13],[30,3,30,6],[31,3,31,6],[30,1,30,2],[8,2,8,4],[16,2,16,4],[32,7,32,13],[33,7,33,13],[34,7,34,13],[35,7,35,13],[35,1,35,2],[32,3,32,6],[31,1,31,2],[32,1,32,2],[33,1,33,2],[34,1,34,2],[33,3,33,6],[34,3,34,6],[35,3,35,6],[36,7,36,13],[37,7,37,13],[38,7,38,13],[48,1,48,2],[48,7,48,13],[39,1,39,2],[36,1,36,2],[42,1,42,2],[42,7,42,13],[43,1,43,2],[43,7,43,13],[40,1,40,2],[40,7,40,13],[41,1,41,2],[41,7,41,13],[37,1,37,2],[39,7,39,13],[38,1,38,2],[37,3,37,6],[36,3,36,6],[38,3,38,6],[39,3,39,6],[40,3,40,6],[41,3,41,6],[49,1,49,2],[49,7,49,13],[46,1,46,2],[46,7,46,13],[47,1,47,2],[47,7,47,13],[44,1,44,2],[44,7,44,13],[45,1,45,2],[45,7,45,13],[49,3,49,6],[54,1,54,2],[54,7,54,13],[55,1,55,2],[55,7,55,13],[52,1,52,2],[52,7,52,13],[53,1,53,2],[53,7,53,13],[50,1,50,2],[50,7,50,13],[51,1,51,2],[51,7,51,13],[51,3,51,6],[52,3,52,6],[53,3,53,6],[54,3,54,6],[55,3,55,6],[50,3,50,6],[60,1,60,2],[60,7,60,13],[61,1,61,2],[61,7,61,13],[58,1,58,2],[58,7,58,13],[59,1,59,2],[59,7,59,13],[56,1,56,2],[56,7,56,13],[57,1,57,2],[57,7,57,13],[56,3,56,6],[57,3,57,6],[58,3,58,6],[59,3,59,6],[60,3,60,6],[61,3,61,6],[66,1,66,2],[66,7,66,13],[67,1,67,2],[67,7,67,13],[64,1,64,2],[64,7,64,13],[65,1,65,2],[65,7,65,13],[62,1,62,2],[62,7,62,13],[63,1,63,2],[63,7,63,13],[62,3,62,6],[63,3,63,6],[64,3,64,6],[65,3,65,6],[66,3,66,6],[67,3,67,6],[72,1,72,2],[72,7,72,13],[73,1,73,2],[73,7,73,13],[70,1,70,2],[70,7,70,13],[71,1,71,2],[71,7,71,13],[68,1,68,2],[68,7,68,13],[69,1,69,2],[69,7,69,13],[68,3,68,6],[69,3,69,6],[70,3,70,6],[71,3,71,6],[72,3,72,6],[73,3,73,6],[78,1,78,2],[78,7,78,13],[79,1,79,2],[79,7,79,13],[76,1,76,2],[76,7,76,13],[77,1,77,2],[77,7,77,13],[74,1,74,2],[74,7,74,13],[75,1,75,2],[75,7,75,13],[74,3,74,6],[75,3,75,6],[76,3,76,6],[77,3,77,6],[78,3,78,6],[79,3,79,6],[84,1,84,2],[84,7,84,13],[85,1,85,2],[85,7,85,13],[82,1,82,2],[82,7,82,13],[83,1,83,2],[83,7,83,13],[80,1,80,2],[80,7,80,13],[81,1,81,2],[81,7,81,13],[80,3,80,6],[81,3,81,6],[82,3,82,6],[83,3,83,6],[84,3,84,6],[85,3,85,6],[90,1,90,2],[90,7,90,13],[91,1,91,2],[91,7,91,13],[88,1,88,2],[88,7,88,13],[89,1,89,2],[89,7,89,13],[86,1,86,2],[86,7,86,13],[87,1,87,2],[87,7,87,13],[86,3,86,6],[87,3,87,6],[88,3,88,6],[89,3,89,6],[90,3,90,6],[91,3,91,6],[96,1,96,2],[96,7,96,13],[97,1,97,2],[97,7,97,13],[94,1,94,2],[94,7,94,13],[95,1,95,2],[95,7,95,13],[92,1,92,2],[92,7,92,13],[93,1,93,2],[93,7,93,13],[92,3,92,6],[93,3,93,6],[94,3,94,6],[95,3,95,6],[96,3,96,6],[97,3,97,6],[102,1,102,2],[102,7,102,13],[103,1,103,2],[103,7,103,13],[100,1,100,2],[100,7,100,13],[101,1,101,2],[101,7,101,13],[98,1,98,2],[98,7,98,13],[99,1,99,2],[99,7,99,13],[98,3,98,6],[99,3,99,6],[100,3,100,6],[101,3,101,6],[102,3,102,6],[103,3,103,6],[108,1,108,2],[108,7,108,13],[109,1,109,2],[109,7,109,13],[106,1,106,2],[106,7,106,13],[107,1,107,2],[107,7,107,13],[104,1,104,2],[104,7,104,13],[105,1,105,2],[105,7,105,13],[104,3,104,6],[105,3,105,6],[106,3,106,6],[107,3,107,6],[108,3,108,6],[109,3,109,6],[114,1,114,2],[114,7,114,13],[115,1,115,2],[115,7,115,13],[112,1,112,2],[112,7,112,13],[113,1,113,2],[113,7,113,13],[110,1,110,2],[110,7,110,13],[111,1,111,2],[111,7,111,13],[110,3,110,6],[111,3,111,6],[112,3,112,6],[113,3,113,6],[114,3,114,6],[115,3,115,6],[120,1,120,2],[120,7,120,13],[121,1,121,2],[121,7,121,13],[118,1,118,2],[118,7,118,13],[119,1,119,2],[119,7,119,13],[116,1,116,2],[116,7,116,13],[117,1,117,2],[117,7,117,13],[116,3,116,6],[117,3,117,6],[118,3,118,6],[119,3,119,6],[120,3,120,6],[121,3,121,6],[124,1,124,2],[124,7,124,13],[125,1,125,2],[125,7,125,13],[122,1,122,2],[122,7,122,13],[123,1,123,2],[123,7,123,13],[122,3,122,6],[123,3,123,6],[124,3,124,6],[125,3,125,6],[128,1,128,2],[128,7,128,13],[129,1,129,2],[129,7,129,13],[128,3,128,6],[129,3,129,6],[126,1,126,2],[126,7,126,13],[127,1,127,2],[127,7,127,13],[126,3,126,6],[127,3,127,6]]}
[]
[]
[null,"Please select your language:",null,null,"English",null,null,null,null,null,null,null,null,"Version 3.2"]
[null,{"$f":"'Trunking Translation'!$B$13","v":"OPPLE LED Trunking Configurator"}]
[]
[]
[null,{"$f":"'Trunking Translation'!$B$14","v":"Project Information"}]
[]
[null,null,{"$f":"'Trunking Translation'!B15","v":"Project Name*"}]
[]
[null,null,null,{"$f":"'Trunking Translation'!B16","v":"Wholesaler"}]
[]
[null,null,null,{"$f":"'Trunking Translation'!B17","v":"Installer"}]
[]
[null,{"$f":"'Trunking Translation'!B18","v":"OPPLE Lighting B.V Information"}]
{"$rows_left_out":116}
{"sheet":"Validation Sheet","index":1,"n_rows":100,"n_cols":1,"rows_kept":100,"cut":false,"hidden":true,"merged":[]}
[1]
[2]
[3]
[4]
[5]
[6]
[7]
[8]
[9]
[10]
[11]
[12]
[13]
[14]
[15]
{"$rows_left_out":86}
{"sheet":"Input Form","index":2,"n_rows":114,"n_cols":37,"rows_kept":114,"cut":false,"hidden":true,"merged":[[11,18,13,18],[11,19,13,19],[3,1,5,17],[7,3,7,5],[8,3,8,5],[9,3,9,5],[11,9,13,9],[11,12,13,12],[11,1,13,1],[11,10,13,10],[6,2,6,3],[11,2,13,2],[11,3,13,3],[11,4,13,4],[11,5,13,5],[11,7,13,7],[11,8,13,8],[11,17,13,17],[11,6,13,6],[11,13,13,13],[11,14,13,14],[11,16,13,16],[11,15,13,15],[11,11,13,11]]}
[]
[]
[null,null,null,null,null,null,null,null,null,null,null,null,null,null,null,null,null,null,null,null,null,null,null,null,null,null,null,null,null,null,null,"Probe L"]
[null,{"$f":"'Trunking Translation'!B25","v":"OPPLE LED Trunking: Input Form"},null,null,null,null,null,null,null,null,null,null,null,null,null,null,null,null,null,null,null,null,null,"No. of Senfor per Line (FULL)",null,null,null,null,null,null,null,"Probe H",null,null,null,null,"Installation Height"]
[null,null,null,null,null,null,null,null,null,null,null,null,null,null,null,null,null,null,null,null,null,null,null,{"$f":"IFERROR(ROUNDUP(IF(Q15=$AF$6,1,IF(Q15=$AF$7,2,IF($AF$8=$AF$8,IF(P15=$AF$3,E15/VLOOKUP(O15,'Art. List'!I5:K15,2,FALSE),IF('Input Form'!P15='Input Form'!$AF$4,'Input Form'!E15/VLOOKUP('Input Form'!O15,'Art. List'!$I$5:$K$15,3,FALSE),0)),$AH$15))),0),0)","v":0},null,null,null,null,null,null,null,null,null,"LED Module Occupation per Line",null,null,3]
[null,null,null,null,null,null,null,null,null,null,null,null,null,null,null,null,null,null,null,null,null,null,null,null,null,null,null,null,null,null,null,{"$f":"'Trunking Translation'!B84","v":"Begin"},null,{"$f":"'Trunking Translation'!B52","v":"Full"},null,null,4]
[null,null,null,null,null,null,null,null,null,null,null,null,null,null,null,null,null,null,null,null,null,null,null,null,null,null,null,null,null,null,null,{"$f":"'Trunking Translation'!B85","v":"Begin-End"},null,{"$f":"'Trunking Translation'!B53","v":"Half"},null,null,5]
[null,null,{"$f":"'Trunking Translation'!B15","v":"Project Name*"},{"$f":"IF(ISBLANK('Project Information'!F9),\"\",'Project Information'!F9)","v":""},null,null,null,{"$f":"'Trunking Translation'!B19","v":"Representative*"},{"$f":"IF(ISBLANK('Project Information'!F17),\"\",'Project Information'!F17)","v":""},null,null,null,null,null,null,null,null,null,null,null,null,null,null,null,null,null,null,null,null,null,null,{"$f":"'Trunking Translation'!$B$52","v":"Full"},null,{"$f":"'Trunking Translation'!B54","v":"One-Third"},null,null,6]
[null,null,{"$f":"'Trunking Translation'!B16","v":"Wholesaler"},{"$f":"IF(ISBLANK('Project Information'!F11),\"\",'Project Information'!F11)","v":""},null,null,null,{"$f":"'Trunking Translation'!B20","v":"Date"},{"$f":"'Project Information'!F19","v":"2021-06-04"},null,null,null,null,null,null,null,null,null,null,null,null,null,null,null,null,null,null,null,null,null,null,{"$f":"'Trunking Translation'!$B$55","v":"Custom"},null,{"$f":"'Trunking Translation'!B55","v":"Custom"},null,null,7]
[null,null,{"$f":"'Trunking Translation'!B17","v":"Installer"},{"$f":"IF(ISBLANK('Project Information'!F13),\"\",'Project Information'!F13)","v":""},null,null,null,null,null,null,null,null,null,null,null,null,null,null,null,null,null,null,null,null,null,null,null,null,null,null,null,null,null,null,null,null,8]
[null,null,null,null,null,null,null,null,null,null,null,null,null,null,null,null,null,null,null,null,null,null,null,null,null,null,null,null,null,null,null,null,null,null,null,null,9]
[null,{"$f":"'Trunking Translation'!B23","v":"Section"},{"$f":"'Trunking Translation'!B29","v":"LED Module"},{"$f":"'Trunking Translation'!B30","v":"No. of Lines"},{"$f":"'Trunking Translation'!B31","v":"Length per line (m)"},{"$f":"'Trunking Translation'!B32","v":"Feed-in-box"},{"$f":"'Trunking Translation'!C72","v":"Feed-out-box"},{"$f":"'Trunking Translation'!B33","v":"Mounting Method"},{"$f":"'Trunking Translation'!B34","v":"LED Module Occupation per Line"},{"$f":"'Trunking Translation'!B36","v":"LED Modules per Line"},{"$f":"'Trunking Translation'!B35","v":"Custom Amount"},{"$f":"'Trunking Translation'!B87","v":"Blind Covers per line"},{"$f":"'Trunking Translation'!B37","v":"Line ends with LED Module?"},{"$f":"'Trunking Translation'!$B73","v":"Sensor"},{"$f":"'Trunking Translation'!$B74","v":"Installation Height (m)"},{"$f":"'Trunking Translation'!$B76","v":"Sensor Type"},{"$f":"'Trunking Translation'!$B75","v":"Sensor Occupation per Line"},{"$f":"'Trunking Translation'!$B77","v":"No. of Sensors per Line"},{"$f":"'Trunking Translation'!B35","v":"Custom Amount"},"DALI \nPower Supply",null,null,null,null,null,null,null,null,null,null,null,true,null,null,null,null,10]
[null,null,null,null,null,null,null,null,null,null,null,null,null,null,null,null,null,null,null,null,null,"DALI",null,null,null,null,null,null,null,null,null,false,null,{"$f":"'Trunking Translation'!B47","v":"Yes"},null,null,12.5]
[null,null,null,null,null,null,null,null,null,null,null,null,null,null,null,null,null,null,null,null,null,null,null,null,null,null,null,null,null,null,null,null,null,{"$f":"'Trunking Translation'!B48","v":"No"}]
[null,{"$f":"IF('Project Information'!D31=0,\"\",'Project Information'!D31)","v":""},null,null,null,null,null,null,null,{"$f":"ROUNDUP(IF(I15=$AH$6,E15/1.5,IF(I15=$AH$7,E15/3,IF(I15=$AH$8,E15/4.5,IF(I15=$AH$9,K15,0)))),)","v":0},null,{"$f":"E15/1.5-J15","v":0},{"$f":"IF(ISBLANK(I15),\"\",IF(I15=$AH$7,IF(RIGHT(E15/3-TRUNC(E15/3),1)=\"5\",$AH$13,$AH$14),IF(I15=$AH$8,IF(RIGHT(E15/4.5-TRUNC(E15/4.5),1)=\"3\",$AH$13,$AH$14),IF(I15=$AH$6,$AH$13,$AH$15))))","v":""},null,null,null,null,{"$f":"IFERROR(ROUNDUP(IF(Q15=$AF$6,1,IF(Q15=$AF$7,2,IF(Q15=$AF$8,IF(P15=$AF$3,E15/VLOOKUP(O15,'Art. List'!I5:K15,2,FALSE),IF('Input Form'!P15='Input Form'!$AF$4,'Input Form'!E15/VLOOKUP('Input Form'!O15,'Art. List'!$I$5:$K$15,3,FALSE),0)),$AH$15))),0),S15)","v":0},null,null,false,null,null,null,null,null,null,null,null,null,null,null,null,{"$f":"'Trunking Translation'!B57","v":"Unknown"}]
{"$rows_left_out":100}
{"sheet":"Trunking Translation","index":3,"n_rows":88,"n_cols":13,"rows_kept":88,"cut":false,"hidden":true,"merged":[[59,0,69,0],[1,0,10,0],[12,0,22,0],[24,0,26,0],[28,0,44,0],[46,0,57,0]]}
[{"$f":"IF('Project Information'!$E$3='Trunking Translation'!M1,1,IF('Project Information'!$E$3='Trunking Translation'!M2,2,IF('Project Information'!$E$3='Trunking Translation'!M3,3,IF('Project Information'!$E$3='Trunking Translation'!M4,4,IF('Project Information'!$E$3='Trunking Translation'!M5,5,IF('Project Information'!$E$3='Trunking Translation'!M6,6,IF('Project Information'!$E$3='Trunking Translation'!M7,7,\"\")))))))","v":1},null,"English","Nederlands","German","Italian","French","Spanish","Polish",null,null,null,"English"]
["Navigation Panel ",{"$f":"CONCATENATE(\"1. \",VLOOKUP(C2,$C:$L,$A$1,FALSE))","v":"1. Start Page"},"Start Page","Begin pagina","Startseite","Pagina iniziale","Page d'accueil","Página de inicio","Strona startowa",null,null,null,"Nederlands"]
[null,{"$f":"CONCATENATE(\"2. \",VLOOKUP(C3,$C:$L,$A$1,FALSE))","v":"2. Input Form"},"Input Form","Invulformulier","Eingabeformular","Modulo di input","Formulaire de saisie","Formulario de entrada","Formularz wejściowy",null,null,null,"Deutsch"]
[null,{"$f":"CONCATENATE(\"3. \",VLOOKUP(C4,$C:$L,$A$1,FALSE))","v":"3. Configurator"},"Configurator","Configurator","Konfigurator","Configuratore","Configurateur","Configurador","Konfigurator",null,null,null,"Italiano"]
[null,{"$f":"CONCATENATE(\"4. \",VLOOKUP(C5,$C:$L,$A$1,FALSE))","v":"4. Quotation"},"Quotation","Offerte","Angebot","Quotazione","Devis","Presupuesto","Wycena",null,null,null,"Français "]
[null,{"$f":"CONCATENATE(\"5. \",VLOOKUP(C6,$C:$L,$A$1,FALSE))","v":"5. Save As"},"Save As","Opslaan als","Speichern als","Salva come","Sauvegarder comme","Guardar como","Zapisz jako",null,null,null,"Español"]
[null,{"$f":"CONCATENATE(\"6. \",VLOOKUP(C7,$C:$L,$A$1,FALSE))","v":"6. Export PDF"},"Export PDF","Exporteer PDF","Export PDF","Esporta PDF","Exportation PDF","Exportar como PDF","Eksport do PDF",null,null,null,"Polski"]
[null,{"$f":"VLOOKUP(C8,$C:$L,$A$1,FALSE)","v":"Export Excel"},"Export Excel","Exporteer Excel","Export Excel","Esporta Excel","Exportation Excel","Exportar a Excel","Eksport do Excel"]
[null,{"$f":"VLOOKUP(C9,$C:$L,$A$1,FALSE)","v":"Clear Input"},"Clear Input","Wis input","Eingabe löschen","Cancella input","Effacer saisie","Borrar información","Wyczyść dane wejściowe"]
[null,{"$f":"VLOOKUP(C10,$C:$L,$A$1,FALSE)","v":"Update"},"Update","Updaten","Aktualisieren","Aggiornamento","Mise à jour","Actualizar","Aktualizuj"]
[null,{"$f":"VLOOKUP(C11,$C:$L,$A$1,FALSE)","v":"Clear All"},"Clear All","Wis alles","Alles löschen","Cancella tutto","Effacer tout","Borrarlo todo","Wyczyść wszystko"]
[null,null,null,null,null,""]
["Start Page",{"$f":"VLOOKUP(C13,$C:$L,$A$1,FALSE)","v":"OPPLE LED Trunking Configurator"},"OPPLE LED Trunking Configurator","OPPLE LED Trunking Configurator","OPPLE LED Lichtband-Konfigurator","Configuratore Sistema a Binario LED OPPLE","Configurateur rail précâblé OPPLE LEDTrunking","Configurador del sistema Trunking LED de OPPLE","Konfigurator listew oświetleniowych OPPLE LED"]
[null,"Project Information","Project Information","Project informatie","Projektinformation","Informazioni sul progetto","Information projet","Información del proyecto","Informacje o projekcie"]
[null,"Project Name*","Project Name*","Projectnaam*","Projektname*","Nome del progetto*","Nom du projet*","Nombre del proyecto*","Nazwa projektu*"]
{"$rows_left_out":74}
{"sheet":"Quotation","index":4,"n_rows":160,"n_cols":8,"rows_kept":160,"cut":false,"hidden":true,"merged":[[54,1,57,7],[53,1,53,7],[60,3,60,7],[61,3,61,7],[68,3,68,7],[69,3,69,7],[65,3,65,7],[59,1,59,7],[63,3,63,7],[64,3,64,7],[66,3,66,7],[67,3,67,7],[62,3,62,7],[12,1,14,1],[7,1,7,2],[8,4,8,5],[9,4,9,5],[4,1,6,7],[12,7,14,7],[12,2,14,2],[12,3,14,3],[12,4,14,4],[12,5,14,5],[12,6,14,6],[75,3,75,7],[76,3,76,7],[77,3,77,7],[78,3,78,7],[79,3,79,7],[70,3,70,7],[71,3,71,7],[72,3,72,7],[73,3,73,7],[74,3,74,7],[85,3,85,7],[86,3,86,7],[87,3,87,7],[88,3,88,7],[89,3,89,7],[80,3,80,7],[81,3,81,7],[82,3,82,7],[83,3,83,7],[84,3,84,7],[95,3,95,7],[96,3,96,7],[97,3,97,7],[98,3,98,7],[99,3,99,7],[90,3,90,7],[91,3,91,7],[92,3,92,7],[93,3,93,7],[94,3,94,7],[105,3,105,7],[106,3,106,7],[107,3,107,7],[108,3,108,7],[109,3,109,7],[100,3,100,7],[101,3,101,7],[102,3,102,7],[103,3,103,7],[104,3,104,7],[115,3,115,7],[116,3,116,7],[117,3,117,7],[118,3,118,7],[119,3,119,7],[110,3,110,7],[111,3,111,7],[112,3,112,7],[113,3,113,7],[114,3,114,7],[125,3,125,7],[126,3,126,7],[127,3,127,7],[128,3,128,7],[129,3,129,7],[120,3,120,7],[121,3,121,7],[122,3,122,7],[123,3,123,7],[124,3,124,7],[135,3,135,7],[136,3,136,7],[137,3,137,7],[138,3,138,7],[139,3,139,7],[130,3,130,7],[131,3,131,7],[132,3,132,7],[133,3,133,7],[134,3,134,7],[145,3,145,7],[146,3,146,7],[147,3,147,7],[148,3,148,7],[149,3,149,7],[140,3,140,7],[141,3,141,7],[142,3,142,7],[143,3,143,7],[144,3,144,7],[155,3,155,7],[156,3,156,7],[157,3,157,7],[158,3,158,7],[159,3,159,7],[150,3,150,7],[151,3,151,7],[152,3,152,7],[153,3,153,7],[154,3,154,7]]}
[]
[]
[]
[]
[null,{"$f":"'Trunking Translation'!B27","v":"OPPLE LED Trunking: Total Gross Price and Product list"}]
[]
[]
[]
[null,{"$f":"'Project Information'!C9","v":"Project Name*"},{"$f":"IF(ISBLANK('Project Information'!F9),\"\",'Project Information'!F9)","v":""},null,{"$f":"'Project Information'!C17","v":"Representative*"},null,{"$f":"IF(ISBLANK('Project Information'!F17),\"\",'Project Information'!F17)","v":""}]
[null,{"$f":"'Project Information'!D11","v":"Wholesaler"},{"$f":"IF(ISBLANK('Project Information'!F11),\"\",'Project Information'!F11)","v":""},null,{"$f":"'Project Information'!D19","v":"Date"},null,{"$f":"'Project Information'!F19","v":"2021-06-04"}]
[null,{"$f":"'Project Information'!D13","v":"Installer"},{"$f":"IF(ISBLANK('Project Information'!F13),\"\",'Project Information'!F13)","v":""}]
[]
[null,{"$f":"'Trunking Translation'!$B$38","v":"Article Code"},{"$f":"'Trunking Translation'!$B$39","v":"Article Description"},{"$f":"'Trunking Translation'!$B$40","v":"Number of products needed"},{"$f":"'Trunking Translation'!$B$41","v":"Unit Gross Price"},{"$f":"'Trunking Translation'!$B$42","v":"Total Gross Price"},{"$f":"'Trunking Translation'!$B$43","v":"Remarks"},{"$f":"'Trunking Translation'!B45","v":"Power"}]
[null,{"$f":"'Trunking Translation'!$B$38","v":"Article Code"},{"$f":"'Trunking Translation'!$B$39","v":"Article Description"},{"$f":"'Trunking Translation'!$B$40","v":"Number of products needed"},{"$f":"'Trunking Translation'!$B$41","v":"Unit Gross Price"},{"$f":"'Trunking Translation'!$B$42","v":"Total Gross Price"},{"$f":"'Trunking Translation'!$C$43","v":"Remarks"}]
[null,{"$f":"'Trunking Translation'!$B$38","v":"Article Code"},{"$f":"'Trunking Translation'!$B$39","v":"Article Description"},{"$f":"'Trunking Translation'!$B$40","v":"Number of products needed"},{"$f":"'Trunking Translation'!$B$41","v":"Unit Gross Price"},{"$f":"'Trunking Translation'!$B$42","v":"Total Gross Price"},{"$f":"'Trunking Translation'!$C$43","v":"Remarks"}]
{"$rows_left_out":146}
{"sheet":"Instructions","index":5,"n_rows":21,"n_cols":19,"rows_kept":21,"cut":false,"hidden":true,"merged":[[3,0,18,0],[20,0,35,0],[3,9,18,9],[20,9,35,9],[3,18,18,18]]}
[]
[]
[]
["1.",null,null,null,null,null,null,null,null,"2.",null,null,null,null,null,null,null,null,"3."]
[]
[]
[]
[]
[]
[]
[]
[]
[]
[]
[]
{"$rows_left_out":7}
{"sheet":"Configurator","index":6,"n_rows":41,"n_cols":20,"rows_kept":41,"cut":false,"hidden":true,"merged":[[0,5,1,5]]}
[]
[]
[]
[null,{"$f":"IF(ISBLANK('Project Information'!$D$31),'Trunking Translation'!$B$26&\" - \" & 'Project Information'!$B$31,'Trunking Translation'!$B$26&\" - \" &'Project Information'!D31)","v":"OPPLE LED Trunking Configurator - Section_1"}]
[null,{"$f":"CONCATENATE('Project Information'!$C$9,\": \",'Project Information'!$F$9,\"               \",'Project Information'!$D$11,\": \",'Project Information'!$F$11,\"               \",'Project Information'!$D$13,\": \",'Project Information'!$F$13,\"               \",'Project Information'!$C$17,\": \",'Project Information'!$F$17)","v":"Project Name*:                Wholesaler:                Installer:                Representative*: "},null,null,null,null,null,null,null,null,null,null,null,null,null,"LED Module Occupation per Line"]
[]
[null,{"$f":"'Trunking Translation'!$B$29","v":"LED Module"},null,null,{"$f":"'Trunking Translation'!$B$81","v":"ACCESSORY"},null,null,null,null,null,null,null,null,null,null,{"$f":"'Trunking Translation'!B52","v":"Full"}]
[null,{"$f":"'Trunking Translation'!$B$29","v":"LED Module"},"LEDTrunking Module L15-50W-4000-BW",null,{"$f":"'Trunking Translation'!$B$32","v":"Feed-in-box"},"Yes",null,null,null,"Mouting Method","Feed-in box?",null,null,null,null,{"$f":"'Trunking Translation'!B53","v":"Half"},null,null,null,"Probe L"]
[null,{"$f":"'Trunking Translation'!$B$78","v":"Dali Power Supply"},"No",null,{"$f":"'Trunking Translation'!$B$72","v":"Feed-out-box"},"No",null,null,null,{"$f":"'Trunking Translation'!B49","v":"Mounting Clip Chain"},{"$f":"'Trunking Translation'!B47","v":"Yes"},null,null,null,null,{"$f":"'Trunking Translation'!B54","v":"One-Third"},null,null,null,"Probe H"]
[null,null,null,null,{"$f":"'Trunking Translation'!$B$33","v":"Mounting Method"},"Cord 3m",null,null,null,{"$f":"'Trunking Translation'!B50","v":"Cord 3m"},{"$f":"'Trunking Translation'!B48","v":"No"},null,null,null,null,{"$f":"'Trunking Translation'!B55","v":"Custom"}]
[null,null,null,null,null,null,null,null,null,{"$f":"'Trunking Translation'!B51","v":"Mounting Clip"},{"$f":"'Trunking Translation'!$B$57","v":"Unknown"}]
[null,{"$f":"'Trunking Translation'!$B$80","v":"LIGHT LINE CONFIGURATION"},null,null,{"$f":"'Trunking Translation'!$B$82","v":"SENSOR"}]
[null,{"$f":"'Trunking Translation'!$B$30","v":"No. of Lines"},20,null,{"$f":"'Trunking Translation'!$B$73","v":"Sensor"},"No"]
[null,{"$f":"'Trunking Translation'!$B$31","v":"Length per line (m)"},19.5,null,{"$f":"'Trunking Translation'!$B$74","v":"Installation Height (m)"}]
[null,{"$f":"'Trunking Translation'!$B$34","v":"LED Module Occupation per Line"},"Full",null,{"$f":"'Trunking Translation'!$B$76","v":"Sensor Type"}]
{"$rows_left_out":27}
{"sheet":"Components","index":7,"n_rows":68,"n_cols":14,"rows_kept":68,"cut":false,"hidden":true,"merged":[[0,2,0,14]]}
[null,null,"OPPLE LED TRUNKING SYSTEM COMPONENTS"]
[]
[]
[]
[null,null,null,null,"Feed-in Box"]
[null,null,null,null,null,null,null,null,null,null,null,null,null,"Trunk cover"]
[]
[]
[]
[]
[]
[]
[null,null,null,null,"Feed-in connector"]
[]
[null,null,null,null,null,null,null,null,null,null,null,null,null,"LED Module"]
{"$rows_left_out":54}
{"sheet":"Art. List","index":8,"n_rows":41,"n_cols":11,"rows_kept":41,"cut":false,"hidden":true,"merged":[]}
[]
[]
[]
[null,null,null,null,null,null,null,null,"Trunking Sensor Detection Area (100% Sensitivity)"]
[null,null,"Article code","Article Description","Gross Price","Power",null,null,"Installation Height (m)","Probe L (m)","Probe H (m)"]
[null,null,542005008200,"LEDTrunking Module L15-35W-4000-120",156,35,null,null,null,"L1","L1"]
[null,null,542005005800,"LEDTrunking Module L15-50W-4000-120",179,50,null,null,3,5,0]
[null,null,542005005900,"LEDTrunking Module L15-50W-4000-90",179,50,null,null,4,4.5,6.7]
[null,null,542005006000,"LEDTrunking Module L15-50W-4000-60",179,50,null,null,5,4,8.4]
[null,null,542005006100,"LEDTrunking Module L15-50W-4000-BW",179,50,null,null,6,0,10]
[null,null,542005006200,"LEDTrunking Module L15-70W-4000-120",257,70,null,null,7,0,9]
[null,null,542005006300,"LEDTrunking Module L15-70W-4000-90",257,70,null,null,8,0,8]
[null,null,542005006400,"LEDTrunking Module L15-70W-4000-60",257,70,null,null,9,0,7]
[null,null,542005006500,"LEDTrunking Module L15-70W-4000-BW",257,70,null,null,10,0,6]
[null,null,542005008600,"LEDTrunking Module L15-35W-4000-120-DALI",209,35,null,null,12.5,0,3.5]
{"$rows_left_out":26}